BDBM50001572 (gabazine)4-[6-Imino-3-(4-methoxy-phenyl)-6H-pyridazin-1-yl]-butyric acid::4-(6-imino-3-(4-methoxyphenyl)pyridazin-1(6H)-yl)butanoic acid::4-[6-Imino-3-(4-methoxy-phenyl)-6H-pyridazin-1-yl]-butyric acid (gabazine or SR-95331)::4-[6-Imino-3-(4-methoxy-phenyl)-6H-pyridazin-1-yl]-butyric acid(Gabazine)::CHEMBL32503
SMILES COc1ccc(cc1)-c1ccc(=N)n(CCCC(O)=O)n1
InChI Key InChIKey=ACVGNKYJVGNLIL-UHFFFAOYSA-N
Data  1 KI  3 IC50
  Tab Delimited (TSV)   2D SDfile   Computed 3D by Vconf -m prep SDfile
Find this compound or compounds like it in BindingDB:
Activity Spreadsheet -- Enzyme Inhibition Constant Data from BindingDB
Found 4 hits for monomerid = 50001572
TargetGamma-aminobutyric acid receptor subunit alpha-1/beta-3/gamma-2(Homo sapiens (Human))
The Danish University Of Pharmaceutical Sciences
Curated by ChEMBL
LigandPNGBDBM50001572((gabazine)4-[6-Imino-3-(4-methoxy-phenyl)-6H-pyrid...)
Affinity DataKi:  240nM. Assay description: Binding affinity at human GABAA alpha1beta3gamma2S expressed in Xenopus oocytes by voltage-clamp electrophysiology
Target InfoGoogleScholar
In DepthDetails ArticlePubMed
TargetGamma-aminobutyric acid receptor subunit alpha-1/beta-2/gamma-2(Homo sapiens (Human))
University College London
Curated by ChEMBL
LigandPNGBDBM50001572((gabazine)4-[6-Imino-3-(4-methoxy-phenyl)-6H-pyrid...)
Affinity DataIC50:  349nM. Assay description: Antagonist activity at human recombinant GABA A receptor alpha1beta2gamma2S expressed in HEK293 cells assessed as inhibition of GABA-induced current ...
In DepthDetails ArticlePubMed
TargetGamma-aminobutyric acid receptor subunit alpha-1/beta-2/gamma-2(Homo sapiens (Human))
University College London
Curated by ChEMBL
LigandPNGBDBM50001572((gabazine)4-[6-Imino-3-(4-methoxy-phenyl)-6H-pyrid...)
Affinity DataIC50:  240nM. Assay description: Antagonist activity at human alpha1beta2gamma2S GABA(A) receptor expressed in human tsA201 cells assessed as inhibition of GABA-induced membrane pote...
In DepthDetails ArticlePubMed
TargetGamma-aminobutyric acid receptor subunit alpha-1/beta-2/gamma-2(Homo sapiens (Human))
University College London
Curated by ChEMBL
LigandPNGBDBM50001572((gabazine)4-[6-Imino-3-(4-methoxy-phenyl)-6H-pyrid...)
Affinity DataIC50:  240nM. Assay description: Antagonist activity at human alpha1beta2gamma2S GABA-A receptor expressed in tsA201 cells assessed as inhibition of GABA-induced effect after 30 mins...
In DepthDetails ArticlePubMed