BDBM50001900 CHEMBL162182::N-{4-[(4-Phenyl-piperazin-2-ylmethyl)-amino]-phenyl}-methanesulfonamide
SMILES CS(=O)(=O)Nc1ccc(NCC2CN(CCN2)c2ccccc2)cc1
InChI Key InChIKey=LJZGGUYZECFQST-UHFFFAOYSA-N
Data  2 IC50
  Tab Delimited (TSV)   2D SDfile   Computed 3D by Vconf -m prep SDfile
Find this compound or compounds like it in BindingDB:
Activity Spreadsheet -- Enzyme Inhibition Constant Data from BindingDB
Found 2 hits for monomerid = 50001900
TargetBeta-2 adrenergic receptor(Canis familiaris)
Berlex Laboratories
Curated by ChEMBL
LigandPNGBDBM50001900(CHEMBL162182 | N-{4-[(4-Phenyl-piperazin-2-ylmethy...)
Affinity DataIC50:  1.00E+3nM. Assay description: Binding affinity towards Beta-2 adrenergic receptor by displacing [3H]dihydroalprenolol, in partially purified membrane fractions from canine lung ti...
In DepthDetails ArticlePubMed
TargetBeta-1 adrenergic receptor(Homo sapiens (Human))
Berlex Laboratories
Curated by ChEMBL
LigandPNGBDBM50001900(CHEMBL162182 | N-{4-[(4-Phenyl-piperazin-2-ylmethy...)
Affinity DataIC50:  2.30E+3nM. Assay description: Binding affinity for Beta-1 adrenergic receptor by displacing [3H]dihydroalprenolol, in partially purified membrane fractions from canine ventricular...
In DepthDetails ArticlePubMed