BDBM50001980 6-Dipropylamino-6,7-dihydro-5H-pyrido[1,2,3-de]quinoxalin-3-one::CHEMBL275572
SMILES CCCN(CCC)C1Cc2cccc3ncc(=O)n(C1)c23
InChI Key InChIKey=ZUNQTXSGJHYWAG-UHFFFAOYSA-N
Data  2 KI
  Tab Delimited (TSV)   2D SDfile   Computed 3D by Vconf -m prep SDfile
Find this compound or compounds like it in BindingDB:
Activity Spreadsheet -- Enzyme Inhibition Constant Data from BindingDB
Found 2 hits for monomerid = 50001980
Target5-hydroxytryptamine receptor 1A(Homo sapiens (Human))
Upjohn Laboratories
Curated by ChEMBL
LigandPNGBDBM50001980(6-Dipropylamino-6,7-dihydro-5H-pyrido[1,2,3-de]qui...)
Affinity DataKi:  933nM. Assay description: Ability to displace [3H]-DPAT from 5-hydroxytryptamine 1A receptor in homogenates of bovine hippocampus.
In DepthDetails ArticlePubMed
TargetD(2) dopamine receptor(Rattus norvegicus (rat))
Upjohn Laboratories
Curated by ChEMBL
LigandPNGBDBM50001980(6-Dipropylamino-6,7-dihydro-5H-pyrido[1,2,3-de]qui...)
Affinity DataKi: >1.00E+3nM. Assay description: Ability to displace [3H]raclopride from dopamine receptor D2 in rat striatal homogenates.
In DepthDetails ArticlePubMed