BDBM50002081 CHEMBL610798
SMILES [H][C@@]12Cc3ccc(O)c4O[C@@]5(C)c6[nH]c7ccccc7c6C[C@]1(OCC)C5(CCN2CC1CC1)c34
InChI Key InChIKey=OMUSJJBIQWMCAN-DYOOUZMRSA-N
Data  3 KI
  Tab Delimited (TSV)   2D SDfile   Computed 3D by Vconf -m prep SDfile
Find this compound or compounds like it in BindingDB:
Activity Spreadsheet -- Enzyme Inhibition Constant Data from BindingDB
Found 3 hits for monomerid = 50002081
TargetDelta-type opioid receptor(Rattus norvegicus (rat))
University Of Medicine & Dentistry Of New Jersey-Robert Wood Johnson Medical School (Umdnj-Rwjms)
Curated by ChEMBL
LigandPNGBDBM50002081(CHEMBL610798)
Affinity DataKi:  0.790nM. Assay description: Binding affinity against Opioid receptor delta 1 from rat brain membranes using [3H]DADLEChecked by Author
In DepthDetails ArticlePubMed
TargetMu-type opioid receptor(Rattus norvegicus (rat))
University Of Medicine & Dentistry Of New Jersey-Robert Wood Johnson Medical School (Umdnj-Rwjms)
Curated by ChEMBL
LigandPNGBDBM50002081(CHEMBL610798)
Affinity DataKi:  39nM. Assay description: Binding affinity against Opioid receptor mu 1 from rat brain membranes using [3H]DAMGOChecked by Author
In DepthDetails ArticlePubMed
TargetKappa-type opioid receptor(Cavia porcellus (domestic guinea pig))
University Of Medicine & Dentistry Of New Jersey-Robert Wood Johnson Medical School (Umdnj-Rwjms)
Curated by ChEMBL
LigandPNGBDBM50002081(CHEMBL610798)
Affinity DataKi:  59nM. Assay description: Binding affinity against Opioid receptor kappa 1 from guinea pig brain membranes using [3H]U-69593Checked by Author
In DepthDetails ArticlePubMed