BDBM50002083 2-[11-(3-Dimethylamino-propylidene)-6,11-dihydro-dibenzo[b,e]oxepin-2-yl]-ethanol::CHEMBL65612
SMILES CN(C)CC\C=C1/c2ccccc2COc2ccc(CCO)cc12
InChI Key InChIKey=ZKOHNNRBHUBCOD-UFWORHAWSA-N
Data  1 KI
  Tab Delimited (TSV)   2D SDfile   Computed 3D by Vconf -m prep SDfile
Find this compound or compounds like it in BindingDB:
Activity Spreadsheet -- Enzyme Inhibition Constant Data from BindingDB
Found 1 hit for monomerid = 50002083
TargetHistamine H1 receptor(Cavia porcellus (domestic guinea pig))
Kyowa Hakko Kogyo
Curated by ChEMBL
LigandPNGBDBM50002083(2-[11-(3-Dimethylamino-propylidene)-6,11-dihydro-d...)
Affinity DataKi:  0.480nM. Assay description: Binding affinity for histamine H1 receptor from guinea pig cerebellum, using [3H]pyrilamine as radioligand at 0.1 uM
In DepthDetails ArticlePubMed