BDBM50002109 CHEMBL370735
SMILES COc1cccc2CC3N(CC4CC4)CCC4(CC(=O)CC[C@@]34OCCCc3ccccc3)c12
InChI Key InChIKey=UFAUQZKEVAHHCZ-ACZHUXRJSA-N
Data  3 KI
  Tab Delimited (TSV)   2D SDfile   Computed 3D by Vconf -m prep SDfile
Find this compound or compounds like it in BindingDB:
Activity Spreadsheet -- Enzyme Inhibition Constant Data from BindingDB
Found 3 hits for monomerid = 50002109
TargetMu-type opioid receptor(Rattus norvegicus (rat))
University Of Medicine & Dentistry Of New Jersey-Robert Wood Johnson Medical School (Umdnj-Rwjms)
Curated by ChEMBL
LigandPNGBDBM50002109(CHEMBL370735)
Affinity DataKi:  0.340nM. Assay description: Binding affinity against Opioid receptor mu 1 from rat brain membranes using [3H]DAMGOChecked by Author
In DepthDetails ArticlePubMed
TargetKappa-type opioid receptor(Cavia porcellus (domestic guinea pig))
University Of Medicine & Dentistry Of New Jersey-Robert Wood Johnson Medical School (Umdnj-Rwjms)
Curated by ChEMBL
LigandPNGBDBM50002109(CHEMBL370735)
Affinity DataKi:  7.40nM. Assay description: Binding affinity against Opioid receptor kappa 1 from guinea pig brain membranes using [3H]U-69593Checked by Author
In DepthDetails ArticlePubMed
TargetDelta-type opioid receptor(Rattus norvegicus (rat))
University Of Medicine & Dentistry Of New Jersey-Robert Wood Johnson Medical School (Umdnj-Rwjms)
Curated by ChEMBL
LigandPNGBDBM50002109(CHEMBL370735)
Affinity DataKi:  17nM. Assay description: Binding affinity against Opioid receptor delta 1 from rat brain membranes using [3H]DADLEChecked by Author
In DepthDetails ArticlePubMed