BDBM50002207 1-Cyclopropylmethyl-4-(4-fluoro-phenoxymethyl)-piperidine::CHEMBL335327
SMILES Fc1ccc(OCC2CCN(CC3CC3)CC2)cc1
InChI Key InChIKey=GXKBHNBKDZPNIG-UHFFFAOYSA-N
Data  2 KI  1 IC50
  Tab Delimited (TSV)   2D SDfile   Computed 3D by Vconf -m prep SDfile
Find this compound or compounds like it in BindingDB:
Activity Spreadsheet -- Enzyme Inhibition Constant Data from BindingDB
Found 3 hits for monomerid = 50002207
TargetSigma non-opioid intracellular receptor 1(Mus musculus (Mouse))
Dupont Pharmaceuticals
Curated by ChEMBL
LigandPNGBDBM50002207(1-Cyclopropylmethyl-4-(4-fluoro-phenoxymethyl)-pip...)
Affinity DataKi:  2nM. Assay description: In vitro binding affinity for the mouse sigma opioid receptor
In DepthDetails ArticlePubMed
Target5-hydroxytryptamine receptor 2A/2B/2C(Mus musculus (Mouse))
Dupont Pharmaceuticals
Curated by ChEMBL
LigandPNGBDBM50002207(1-Cyclopropylmethyl-4-(4-fluoro-phenoxymethyl)-pip...)
Affinity DataKi:  9nM. Assay description: In vitro binding affinity for serotonin 5-hydroxytryptamine (5-HT) 2 receptors
In DepthDetails ArticlePubMed
TargetD(2) dopamine receptor(Mus musculus (Mouse))
Dupont Pharmaceuticals
Curated by ChEMBL
LigandPNGBDBM50002207(1-Cyclopropylmethyl-4-(4-fluoro-phenoxymethyl)-pip...)
Affinity DataIC50:  381nM. Assay description: In vitro binding affinity towards dopamine receptor D2
In DepthDetails ArticlePubMed