BDBM50002392 1-(1,5-dimethylhexyl)-15a,17a-dimethyl-(15aS,17aR)-2,3,3a,3b,4,5,5a,6,15,15a,15b,16,17,17a-tetradecahydro-1H-benzo[4,5]imidazo[2,1-b]cyclopenta[5,6]naphtho[1,2-g]quinazoline::CHEMBL341283
SMILES CC(C)CCCC(C)[C@@H]1CCC2C3CCC4Cc5nc6nc7ccccc7n6cc5C[C@]4(C)C3CC[C@]12C
InChI Key InChIKey=BHSSZEBVOWUKAL-UJGRMLKRSA-N
Data  1 IC50
  Tab Delimited (TSV)   2D SDfile   Computed 3D by Vconf -m prep SDfile
Find this compound or compounds like it in BindingDB:
Activity Spreadsheet -- Enzyme Inhibition Constant Data from BindingDB
Found 1 hit for monomerid = 50002392
TargetSubstance-P receptor(Rattus norvegicus (rat))
Rochester
Curated by ChEMBL
LigandPNGBDBM50002392(1-(1,5-dimethylhexyl)-15a,17a-dimethyl-(15aS,17aR)...)
Affinity DataIC50: >1.00E+4nM. Assay description: Inhibition of [125]I-Bolton Hunter Substance P([125]I-BHSP) binding to Tachykinin receptor 1 from rat forebrain membranes.
In DepthDetails ArticlePubMed