BDBM50002553 Benzyloxycarbonyl-D-Pro-Gln-Gln-OH::CHEMBL293179
SMILES NC(=O)CC[C@H](NC(=O)OCc1ccccc1)C(=O)N[C@@H](CCC(N)=O)C(=O)N[C@H](Cc1c[nH]c2ccccc12)C(O)=O
InChI Key InChIKey=JCOGRWPRTDPJTH-RJGXRXQPSA-N
Data  1 IC50
  Tab Delimited (TSV)   2D SDfile   Computed 3D by Vconf -m prep SDfile
Find this compound or compounds like it in BindingDB:
Activity Spreadsheet -- Enzyme Inhibition Constant Data from BindingDB
Found 1 hit for monomerid = 50002553
TargetSubstance-P receptor(GUINEA PIG)
Fujisawa Pharmaceutical
Curated by ChEMBL
LigandPNGBDBM50002553(Benzyloxycarbonyl-D-Pro-Gln-Gln-OH | CHEMBL293179)
Affinity DataIC50: >1.00E+5nM. Assay description: Displacement of specific binding of [3H]SP to tachykinin receptor 1 from the isolated guinea pig tracheal strips
In DepthDetails ArticlePubMed