BDBM50002575 CHEMBL64166::benzyl 2-[1-[3-carbamoyl-1-neopentylcarboxamido-(1S)-propylcarboxamido]-2-(1-formyl-1H-3-indolyl)-(1R)-ethylcarboxamido]-3-(4-hydroxyphenyl)-(2S)-propanoate
SMILES CC(C)(C)OC(=O)N[C@@H](CCC(N)=O)C(=O)N[C@H](Cc1cn(C=O)c2ccccc12)C(=O)N[C@@H](Cc1ccc(O)cc1)C(=O)OCc1ccccc1
InChI Key InChIKey=GSQFGMGRWHBKAS-YPKYBTACSA-N
Data  1 IC50
  Tab Delimited (TSV)   2D SDfile   Computed 3D by Vconf -m prep SDfile
Find this compound or compounds like it in BindingDB:
Activity Spreadsheet -- Enzyme Inhibition Constant Data from BindingDB
Found 1 hit for monomerid = 50002575
TargetSubstance-P receptor(GUINEA PIG)
Fujisawa Pharmaceutical
Curated by ChEMBL
LigandPNGBDBM50002575(CHEMBL64166 | benzyl 2-[1-[3-carbamoyl-1-neopentyl...)
Affinity DataIC50:  390nM. Assay description: Displacement of specific binding of [3H]SP to tachykinin receptor 1 from the isolated guinea pig tracheal strips
In DepthDetails ArticlePubMed