BDBM50002798 CHEMBL114798::{11-[2-(5,6-Dimethyl-benzoimidazol-1-yl)-ethylidene]-6,11-dihydro-dibenzo[b,e]oxepin-2-yl}-acetic acid
SMILES Cc1cc2ncn(C\C=C3/c4ccccc4COc4ccc(CC(O)=O)cc34)c2cc1C
InChI Key InChIKey=KRGDODMQPWYVPR-LSFURLLWSA-N
Data  1 KI
  Tab Delimited (TSV)   2D SDfile   Computed 3D by Vconf -m prep SDfile
Find this compound or compounds like it in BindingDB:
Activity Spreadsheet -- Enzyme Inhibition Constant Data from BindingDB
Found 1 hit for monomerid = 50002798
TargetThromboxane A2 receptor(Homo sapiens (Human))
Kyowa Hakko Kogyo
Curated by ChEMBL
LigandPNGBDBM50002798(CHEMBL114798 | {11-[2-(5,6-Dimethyl-benzoimidazol-...)
Affinity DataKi:  63nM. Assay description: Binding affinity at TXA2/PGH2 receptor by measuring its ability to displace [3H]-U-46,619 from guinea pig platelets
In DepthDetails ArticlePubMed