BDBM50003063 CHEMBL3234237
SMILES Fc1ccc(CN2CCC(CC2)Nc2ccc(nn2)C(F)(F)F)cc1F
InChI Key InChIKey=UVUYWJWYRLJHEN-UHFFFAOYSA-N
Data  2 KI
  Tab Delimited (TSV)   2D SDfile   Computed 3D by Vconf -m prep SDfile
Find this compound or compounds like it in BindingDB:
Activity Spreadsheet -- Enzyme Inhibition Constant Data from BindingDB
Found 2 hits for monomerid = 50003063
TargetD(2) dopamine receptor(Homo sapiens (Human))
National Center For Advancing Translational Sciences
Curated by ChEMBL
LigandPNGBDBM50003063(CHEMBL3234237)
Affinity DataKi:  158nM. Assay description: Displacement of [3H]methylspiperone from human D2L receptor expressed in HEK cell membrane after 90 mins by scintillation counting analysis
In DepthDetails ArticlePubMed
TargetD(3) dopamine receptor(Homo sapiens (Human))
National Center For Advancing Translational Sciences
Curated by ChEMBL
LigandPNGBDBM50003063(CHEMBL3234237)
Affinity DataKi:  1.16E+3nM. Assay description: Displacement of [3H]methylspiperone from human D3 receptor expressed in HEK293 cell membrane after 90 mins by scintillation counting analysis
In DepthDetails ArticlePubMed