BDBM50003086 CHEMBL409440
SMILES CCCn1c2cc([nH]c2c(=O)n(CCC)c1=O)-c1ccc(OCC(=O)N2CCN(CC2)c2cnccn2)cc1
InChI Key InChIKey=MQZROKRSWMZJNB-UHFFFAOYSA-N
Data  1 KI
  Tab Delimited (TSV)   2D SDfile   Computed 3D by Vconf -m prep SDfile
Find this compound or compounds like it in BindingDB:
Activity Spreadsheet -- Enzyme Inhibition Constant Data from BindingDB
Found 1 hit for monomerid = 50003086
TargetAdenosine receptor A2b(Homo sapiens (Human))
Universit£
Curated by ChEMBL
LigandPNGBDBM50003086(CHEMBL409440)
Affinity DataKi:  100nM. Assay description: Displacement of [3H]DPCPX from human adenosine A2B receptor expressed in HEK293 cellsChecked by Author
In DepthDetails ArticlePubMed