BDBM50003090 CHEMBL260495
SMILES Cn1c2cc([nH]c2c(=O)n(C)c1=O)-c1ccc(OCC(=O)N2CCN(CC2)c2ccccn2)cc1
InChI Key InChIKey=COZXTLBZZGTRNN-UHFFFAOYSA-N
Data  2 KI
  Tab Delimited (TSV)   2D SDfile   Computed 3D by Vconf -m prep SDfile
Find this compound or compounds like it in BindingDB:
Activity Spreadsheet -- Enzyme Inhibition Constant Data from BindingDB
Found 2 hits for monomerid = 50003090
TargetAdenosine receptor A2b(Homo sapiens (Human))
Universit£
Curated by ChEMBL
LigandPNGBDBM50003090(CHEMBL260495)
Affinity DataKi:  59nM. Assay description: Displacement of [3H]DPCPX from human adenosine A2B receptor expressed in HEK293 cellsChecked by Author
In DepthDetails ArticlePubMed
TargetAdenosine receptor A2a(Homo sapiens (Human))
Universit£
Curated by ChEMBL
LigandPNGBDBM50003090(CHEMBL260495)
Affinity DataKi:  708nM. Assay description: Displacement of [3H]ZM-241385 from human adenosine A2A receptor expressed in CHO cellsChecked by Author
In DepthDetails ArticlePubMed