BDBM50003104 CHEMBL409725
SMILES Cn1c2cc([nH]c2c(=O)n(C)c1=O)-c1ccc(OCC(=O)N2CCN(CC2)c2ccc(O)cc2)cc1
InChI Key InChIKey=SJGDZSBNMDQWIZ-UHFFFAOYSA-N
Data  2 KI
  Tab Delimited (TSV)   2D SDfile   Computed 3D by Vconf -m prep SDfile
Find this compound or compounds like it in BindingDB:
Activity Spreadsheet -- Enzyme Inhibition Constant Data from BindingDB
Found 2 hits for monomerid = 50003104
TargetAdenosine receptor A2b(Homo sapiens (Human))
Universit£
Curated by ChEMBL
LigandPNGBDBM50003104(CHEMBL409725)
Affinity DataKi:  28nM. Assay description: Displacement of [3H]DPCPX from human adenosine A2B receptor expressed in HEK293 cellsChecked by Author
In DepthDetails ArticlePubMed
TargetAdenosine receptor A2a(Homo sapiens (Human))
Universit£
Curated by ChEMBL
LigandPNGBDBM50003104(CHEMBL409725)
Affinity DataKi:  617nM. Assay description: Displacement of [3H]ZM-241385 from human adenosine A2A receptor expressed in CHO cellsChecked by Author
In DepthDetails ArticlePubMed