BDBM50003106 CHEMBL411314
SMILES COc1cc(OCC(=O)N2CCN(CC2)c2ccc(Cl)cc2)ccc1-c1cc2n(C)c(=O)n(C)c(=O)c2[nH]1
InChI Key InChIKey=DOSSCQWVJFOSEF-UHFFFAOYSA-N
Data  1 KI
  Tab Delimited (TSV)   2D SDfile   Computed 3D by Vconf -m prep SDfile
Find this compound or compounds like it in BindingDB:
Activity Spreadsheet -- Enzyme Inhibition Constant Data from BindingDB
Found 1 hit for monomerid = 50003106
TargetAdenosine receptor A2b(Homo sapiens (Human))
Universit£
Curated by ChEMBL
LigandPNGBDBM50003106(CHEMBL411314)
Affinity DataKi:  479nM. Assay description: Displacement of [3H]DPCPX from human adenosine A2B receptor expressed in HEK293 cellsChecked by Author
In DepthDetails ArticlePubMed