BDBM50003110 CHEMBL543891::N-[3-(3,5-Di-tert-butyl-4-hydroxy-phenyl)-[1,2,4]thiadiazol-5-yl]-guanidine; hydrochloride
SMILES CC(C)(C)c1cc(cc(c1O)C(C)(C)C)-c1nsc(N=C(N)N)n1
InChI Key InChIKey=NBOPYOBZQNDPOJ-UHFFFAOYSA-N
Data  2 IC50
  Tab Delimited (TSV)   2D SDfile   Computed 3D by Vconf -m prep SDfile
Find this compound or compounds like it in BindingDB:
Activity Spreadsheet -- Enzyme Inhibition Constant Data from BindingDB
Found 2 hits for monomerid = 50003110
TargetProstaglandin G/H synthase 1/2(RAT)
Warner-Lambert
Curated by ChEMBL
LigandPNGBDBM50003110(CHEMBL543891 | N-[3-(3,5-Di-tert-butyl-4-hydroxy-p...)
Affinity DataIC50:  1.60E+3nM. Assay description: Evaluated in vitro for its inhibitory activity against Prostaglandin G/H synthase
In DepthDetails ArticlePubMed
TargetPolyunsaturated fatty acid 5-lipoxygenase(Rattus norvegicus)
Warner-Lambert
Curated by ChEMBL
LigandPNGBDBM50003110(CHEMBL543891 | N-[3-(3,5-Di-tert-butyl-4-hydroxy-p...)
Affinity DataIC50:  140nM. Assay description: Evaluated in vitro for its inhibitory activity against 5-lipoxygenase
In DepthDetails ArticlePubMed