BDBM50003132 3-Ethyl-5,5-dimethyl-4,5-dihydro-3H-[3,4']bipyridinyl-2,6-dione::CHEMBL269761
SMILES CC[C@@]1(CC(C)(C)C(=O)NC1=O)c1ccncc1
InChI Key InChIKey=JTOMKVVXPRFURL-CQSZACIVSA-N
Data  1 IC50
  Tab Delimited (TSV)   2D SDfile   Computed 3D by Vconf -m prep SDfile
Find this compound or compounds like it in BindingDB:
Activity Spreadsheet -- Enzyme Inhibition Constant Data from BindingDB
Found 1 hit for monomerid = 50003132
TargetAromatase(Homo sapiens (Human))
Institute Of Cancer Research
Curated by ChEMBL
LigandPNGBDBM50003132(3-Ethyl-5,5-dimethyl-4,5-dihydro-3H-[3,4']bipyridi...)
Affinity DataIC50: >2.00E+5nM. Assay description: Inhibition of Cytochrome P450 19A1
In DepthDetails ArticlePubMed