BDBM50003148 CHEMBL545754::Methyl-(1-methyl-butyl)-prop-2-ynyl-amine; oxalic acid with HCl
SMILES CCCC(C)N(C)CC#C
InChI Key InChIKey=BSNWMBHBPLPDNI-UHFFFAOYSA-N
Data  3 IC50
  Tab Delimited (TSV)   2D SDfile   Computed 3D by Vconf -m prep SDfile
Find this compound or compounds like it in BindingDB:
Activity Spreadsheet -- Enzyme Inhibition Constant Data from BindingDB
Found 3 hits for monomerid = 50003148
TargetAmine oxidase [flavin-containing] A(Rattus norvegicus (rat))
University Of Saskatchewan
Curated by ChEMBL
LigandPNGBDBM50003148(CHEMBL545754 | Methyl-(1-methyl-butyl)-prop-2-ynyl...)
Affinity DataIC50:  1.20E+4nM. Assay description: Inhibition of Monoamine oxidase A of rat liver mitochondrial membranes
In DepthDetails ArticlePubMed
TargetAmine oxidase [flavin-containing] A/B(Rattus norvegicus (rat))
University Of Saskatchewan
Curated by ChEMBL
LigandPNGBDBM50003148(CHEMBL545754 | Methyl-(1-methyl-butyl)-prop-2-ynyl...)
Affinity DataIC50:  5.60E+3nM. Assay description: Compound was evaluated for the inhibition of deamination of dopamine (DA) by MAO at 5 x 10e-4 M
In DepthDetails ArticlePubMed
TargetAmine oxidase [flavin-containing] B(Rattus norvegicus (rat))
University Of Saskatchewan
Curated by ChEMBL
LigandPNGBDBM50003148(CHEMBL545754 | Methyl-(1-methyl-butyl)-prop-2-ynyl...)
Affinity DataIC50:  180nM. Assay description: Inhibition of Monoamine oxidase B of rat liver mitochondrial membranes
In DepthDetails ArticlePubMed