BDBM50003324 CHEMBL384237::[3,21-Dibenzyl-24-carboxymethyl-12,30-bis-(3-guanidino-propyl)-2,5,8,11,14,20,23,26,29,32-decaoxo-1,4,7,10,13,19,22,25,28,31-decaaza-tricyclo[31.3.0.0*15,19*]hexatriacont-6-yl]-acetic acidcyclo(Pro-Arg-Gly-Asp-D-Phe)2
SMILES NC(=N)NCCC[C@H]1NC(=O)[C@@H]2CCCN2C(=O)[C@H](Cc2ccccc2)NC(=O)[C@@H](CC(O)=O)NC(=O)CNC(=O)[C@@H](CCCNC(N)=N)NC(=O)[C@@H]2CCCN2C(=O)[C@H](Cc2ccccc2)NC(=O)[C@@H](CC(O)=O)NC(=O)CNC1=O
InChI Key InChIKey=LTTDQXHCPTUBMH-VKUCYIRESA-N
Data  1 IC50
  Tab Delimited (TSV)   2D SDfile   Computed 3D by Vconf -m prep SDfile
Find this compound or compounds like it in BindingDB:
Activity Spreadsheet -- Enzyme Inhibition Constant Data from BindingDB
Found 1 hit for monomerid = 50003324
TargetIntegrin alpha-IIb/beta-3(Homo sapiens (Human))
Smithkline Beecham Pharmaceuticals
Curated by ChEMBL
LigandPNGBDBM50003324(CHEMBL384237 | [3,21-Dibenzyl-24-carboxymethyl-12,...)
Affinity DataIC50: >2.00E+5nM. Assay description: Inhibition of ADP-induced platelet aggregation in canine platelet-rich plasma
In DepthDetails ArticlePubMed