BDBM50003382 2-Ethyl-6-(2-fluoro-ethoxy)-4-[2'-(1H-tetrazol-5-yl)-biphenyl-4-ylmethoxy]-quinoline::CHEMBL128389
SMILES CCc1cc(OCc2ccc(cc2)-c2ccccc2-c2nnn[nH]2)c2cc(OCCF)ccc2n1
InChI Key InChIKey=MKPLRVPHRDVIRY-UHFFFAOYSA-N
Data  1 IC50
  Tab Delimited (TSV)   2D SDfile   Computed 3D by Vconf -m prep SDfile
Find this compound or compounds like it in BindingDB:
Activity Spreadsheet -- Enzyme Inhibition Constant Data from BindingDB
Found 1 hit for monomerid = 50003382
TargetType-1 angiotensin II receptor(Cavia porcellus)
Ici Pharmaceuticals Group
Curated by ChEMBL
LigandPNGBDBM50003382(2-Ethyl-6-(2-fluoro-ethoxy)-4-[2'-(1H-tetrazol-5-y...)
Affinity DataIC50:  70nM. Assay description: In vitro inhibition of the specific binding of [125I]-angiotensin II to a guinea pig adrenal membrane preparation
In DepthDetails ArticlePubMed