BDBM50003485 CHEMBL134143::[1-(3,3-Diphenyl-propionyl)-piperidin-4-ylidene]-pyridin-3-yl-acetonitrile; hydrate
SMILES O=[#6](-[#6]-[#6](-c1ccccc1)-c1ccccc1)-[#7]-1-[#6]-[#6]\[#6](-[#6]-[#6]-1)=[#6](\C#N)-c1cccnc1
InChI Key InChIKey=JSIZGZYXULERFB-UHFFFAOYSA-N
Data  1 IC50
  Tab Delimited (TSV)   2D SDfile   Computed 3D by Vconf -m prep SDfile
Find this compound or compounds like it in BindingDB:
Activity Spreadsheet -- Enzyme Inhibition Constant Data from BindingDB
Found 1 hit for monomerid = 50003485
TargetPlatelet-activating factor receptor(Cavia porcellus)
J. Uriach & C£A.S.A.
Curated by ChEMBL
LigandPNGBDBM50003485(CHEMBL134143 | [1-(3,3-Diphenyl-propionyl)-piperid...)
Affinity DataIC50:  26nM. Assay description: Concentration tested in vitro to inhibit PAF-induced maximum aggregation (PAF-Antagonistic activity) by 50%.
In DepthDetails ArticlePubMed