BDBM50003487 3,3-Diphenyl-1-[4-(pyridine-4-sulfonyl)-piperazin-1-yl]-propan-1-one; hydrate::CHEMBL334852
SMILES O=C(CC(c1ccccc1)c1ccccc1)N1CCN(CC1)S(=O)(=O)c1ccncc1
InChI Key InChIKey=KTCLVXGQFKUEEA-UHFFFAOYSA-N
Data  1 IC50
  Tab Delimited (TSV)   2D SDfile   Computed 3D by Vconf -m prep SDfile
Find this compound or compounds like it in BindingDB:
Activity Spreadsheet -- Enzyme Inhibition Constant Data from BindingDB
Found 1 hit for monomerid = 50003487
TargetPlatelet-activating factor receptor(Cavia porcellus)
J. Uriach & C£A.S.A.
Curated by ChEMBL
LigandPNGBDBM50003487(3,3-Diphenyl-1-[4-(pyridine-4-sulfonyl)-piperazin-...)
Affinity DataIC50:  1.10E+4nM. Assay description: Concentration tested in vitro to inhibit PAF-induced maximum aggregation (PAF-Antagonistic activity) by 50%.
In DepthDetails ArticlePubMed