BDBM50003532 CHEMBL554398::{4-[2-(Methyl-phenyl-amino)-acetyl]-piperazin-1-yl}-pyridin-3-yl-acetonitrile; trihydrochloride; hydrate
SMILES CN(CC(=O)N1CCN(CC1)C(C#N)c1cccnc1)c1ccccc1
InChI Key InChIKey=CRTZYQZKKFASQW-UHFFFAOYSA-N
Data  1 IC50
  Tab Delimited (TSV)   2D SDfile   Computed 3D by Vconf -m prep SDfile
Find this compound or compounds like it in BindingDB:
Activity Spreadsheet -- Enzyme Inhibition Constant Data from BindingDB
Found 1 hit for monomerid = 50003532
TargetPlatelet-activating factor receptor(Cavia porcellus)
J. Uriach & C£A.S.A.
Curated by ChEMBL
LigandPNGBDBM50003532(CHEMBL554398 | {4-[2-(Methyl-phenyl-amino)-acetyl]...)
Affinity DataIC50:  2.80E+3nM. Assay description: Concentration tested in vitro to inhibit PAF-induced maximum aggregation (PAF-Antagonistic activity) by 50%.
In DepthDetails ArticlePubMed