BDBM50003534 CHEMBL3215728::Pyridin-3-yl-[4-(3,4,5-trimethoxy-benzoyl)-piperazin-1-yl]-acetonitrile; dihydrochloride; hydrate
SMILES Cl.Cl.COc1cc(cc(OC)c1OC)C(=O)N1CCN(CC1)C(C#N)c1cccnc1
InChI Key InChIKey=QZQMQGQECKJZDT-UHFFFAOYSA-N
Data  1 IC50
  Tab Delimited (TSV)   2D SDfile   Computed 3D by Vconf -m prep SDfile
Find this compound or compounds like it in BindingDB:
Activity Spreadsheet -- Enzyme Inhibition Constant Data from BindingDB
Found 1 hit for monomerid = 50003534
TargetPlatelet-activating factor receptor(Cavia porcellus)
J. Uriach & C£A.S.A.
Curated by ChEMBL
LigandPNGBDBM50003534(CHEMBL3215728 | Pyridin-3-yl-[4-(3,4,5-trimethoxy-...)
Affinity DataIC50:  1.90E+3nM. Assay description: Concentration tested in vitro to inhibit PAF-induced maximum aggregation (PAF-Antagonistic activity) by 50%.
In DepthDetails ArticlePubMed