BDBM50003535 CHEMBL134877::[4-(3,3-Diphenyl-propionyl)-piperazin-1-yl]-(1-methyl-1H-pyrrol-3-yl)-acetonitrile
SMILES Cn1ccc(c1)C(C#N)N1CCN(CC1)C(=O)CC(c1ccccc1)c1ccccc1
InChI Key InChIKey=GLGGFRRLQSUHIT-UHFFFAOYSA-N
Data  1 IC50
  Tab Delimited (TSV)   2D SDfile   Computed 3D by Vconf -m prep SDfile
Find this compound or compounds like it in BindingDB:
Activity Spreadsheet -- Enzyme Inhibition Constant Data from BindingDB
Found 1 hit for monomerid = 50003535
TargetPlatelet-activating factor receptor(Cavia porcellus)
J. Uriach & C£A.S.A.
Curated by ChEMBL
LigandPNGBDBM50003535(CHEMBL134877 | [4-(3,3-Diphenyl-propionyl)-piperaz...)
Affinity DataIC50:  2.60E+3nM. Assay description: Concentration tested in vitro to inhibit PAF-induced maximum aggregation (PAF-Antagonistic activity) by 50%.
In DepthDetails ArticlePubMed