BDBM50003536 (1-Diphenylacetyl-piperidin-4-yl)-pyridin-3-yl-acetonitrile::CHEMBL340544
SMILES O=C(C(c1ccccc1)c1ccccc1)N1CCC(CC1)C(C#N)c1cccnc1
InChI Key InChIKey=DBKJBAQPDMQAHQ-UHFFFAOYSA-N
Data  1 IC50
  Tab Delimited (TSV)   2D SDfile   Computed 3D by Vconf -m prep SDfile
Find this compound or compounds like it in BindingDB:
Activity Spreadsheet -- Enzyme Inhibition Constant Data from BindingDB
Found 1 hit for monomerid = 50003536
TargetPlatelet-activating factor receptor(Cavia porcellus)
J. Uriach & C£A.S.A.
Curated by ChEMBL
LigandPNGBDBM50003536((1-Diphenylacetyl-piperidin-4-yl)-pyridin-3-yl-ace...)
Affinity DataIC50:  21nM. Assay description: Concentration tested in vitro to inhibit PAF-induced maximum aggregation (PAF-Antagonistic activity) by 50%.
In DepthDetails ArticlePubMed