BDBM50003540 CHEMBL541330::[4-(Pyridine-3-carbonyl)-piperazin-1-yl]-(3,4,5-trimethoxy-phenyl)-methanone; hydrochloride; hydrate
SMILES COc1cc(cc(OC)c1OC)C(=O)N1CCN(CC1)C(=O)c1cccnc1
InChI Key InChIKey=YYYXOVFWTJNBFR-UHFFFAOYSA-N
Data  1 IC50
  Tab Delimited (TSV)   2D SDfile   Computed 3D by Vconf -m prep SDfile
Find this compound or compounds like it in BindingDB:
Activity Spreadsheet -- Enzyme Inhibition Constant Data from BindingDB
Found 1 hit for monomerid = 50003540
TargetPlatelet-activating factor receptor(Cavia porcellus)
J. Uriach & C£A.S.A.
Curated by ChEMBL
LigandPNGBDBM50003540(CHEMBL541330 | [4-(Pyridine-3-carbonyl)-piperazin-...)
Affinity DataIC50:  5.20E+3nM. Assay description: Concentration tested in vitro to inhibit PAF-induced maximum aggregation (PAF-Antagonistic activity) by 50%.
In DepthDetails ArticlePubMed