BDBM50003542 CHEMBL542731::[4-(3,3-Diphenyl-propyl)-piperazin-1-yl]-pyridin-3-yl-acetonitrile; trihydrochloride; hydrate
SMILES N#CC(N1CCN(CCC(c2ccccc2)c2ccccc2)CC1)c1cccnc1
InChI Key InChIKey=SYNGIRMTIBKXTF-UHFFFAOYSA-N
Data  1 IC50
  Tab Delimited (TSV)   2D SDfile   Computed 3D by Vconf -m prep SDfile
Find this compound or compounds like it in BindingDB:
Activity Spreadsheet -- Enzyme Inhibition Constant Data from BindingDB
Found 1 hit for monomerid = 50003542
TargetPlatelet-activating factor receptor(Cavia porcellus)
J. Uriach & C£A.S.A.
Curated by ChEMBL
LigandPNGBDBM50003542(CHEMBL542731 | [4-(3,3-Diphenyl-propyl)-piperazin-...)
Affinity DataIC50:  630nM. Assay description: Concentration tested in vitro to inhibit PAF-induced maximum aggregation (PAF-Antagonistic activity) by 50%.
In DepthDetails ArticlePubMed