BDBM50003734 CHEMBL3235300
SMILES CCCCc1ccc(cc1)C1=Nc2c(N)ncnc2OC1(C)C
InChI Key InChIKey=KNMYFXFXPRGRQI-UHFFFAOYSA-N
Data  1 IC50
  Tab Delimited (TSV)   2D SDfile   Computed 3D by Vconf -m prep SDfile
Find this compound or compounds like it in BindingDB:
Activity Spreadsheet -- Enzyme Inhibition Constant Data from BindingDB
Found 1 hit for monomerid = 50003734
TargetDiacylglycerol O-acyltransferase 1(Homo sapiens (Human))
Amgen
Curated by ChEMBL
LigandPNGBDBM50003734(CHEMBL3235300)
Affinity DataIC50:  150nM. Assay description: Inhibition of human liver flag-tagged DGAT1 expressed in baculovirus infected insect cells after 2 hrs by SPA
In DepthDetails ArticlePubMed