BDBM50003773 8-(4-Chloro-benzenesulfonylamino)-5-(2-pyridin-3-yl-ethyl)-octanoic acid::CHEMBL136845
SMILES OC(=O)CCCC(CCCNS(=O)(=O)c1ccc(Cl)cc1)CCc1cccnc1
InChI Key InChIKey=ZOICXOZNBGFULL-UHFFFAOYSA-N
Data  1 IC50
  Tab Delimited (TSV)   2D SDfile   Computed 3D by Vconf -m prep SDfile
Find this compound or compounds like it in BindingDB:
Activity Spreadsheet -- Enzyme Inhibition Constant Data from BindingDB
Found 1 hit for monomerid = 50003773
TargetThromboxane-A synthase(Homo sapiens (Human))
Ciba-Geigy
Curated by ChEMBL
LigandPNGBDBM50003773(8-(4-Chloro-benzenesulfonylamino)-5-(2-pyridin-3-y...)
Affinity DataIC50:  20nM. Assay description: The compound was tested in vitro for its inhibitory activity against thromboxane synthase A2 (TXA2)
In DepthDetails ArticlePubMed