BDBM50003849 CHEMBL3235308
SMILES CC1(C)Oc2ncnc(N)c2N=C1c1ccc(cc1)N1CCOCC1
InChI Key InChIKey=RHWSIGATHISOBR-UHFFFAOYSA-N
Data  1 IC50
  Tab Delimited (TSV)   2D SDfile   Computed 3D by Vconf -m prep SDfile
Find this compound or compounds like it in BindingDB:
Activity Spreadsheet -- Enzyme Inhibition Constant Data from BindingDB
Found 1 hit for monomerid = 50003849
TargetDiacylglycerol O-acyltransferase 1(Homo sapiens (Human))
Amgen
Curated by ChEMBL
LigandPNGBDBM50003849(CHEMBL3235308)
Affinity DataIC50:  610nM. Assay description: Inhibition of human liver flag-tagged DGAT1 expressed in baculovirus infected insect cells after 2 hrs by SPA
In DepthDetails ArticlePubMed