BDBM50003937 CHEMBL3235731
SMILES COc1ccccc1N1CCN(CCCCCC(=O)N2CCC[C@H]2C(N)=O)CC1
InChI Key InChIKey=AEMPUGZDRBBCME-IBGZPJMESA-N
Data  2 KI
  Tab Delimited (TSV)   2D SDfile   Computed 3D by Vconf -m prep SDfile
Find this compound or compounds like it in BindingDB:
Activity Spreadsheet -- Enzyme Inhibition Constant Data from BindingDB
Found 2 hits for monomerid = 50003937
Target5-hydroxytryptamine receptor 1A(Homo sapiens (Human))
Jagiellonian University Medical College
Curated by ChEMBL
LigandPNGBDBM50003937(CHEMBL3235731)
Affinity DataKi:  44nM. Assay description: Displacement of [3H]-8-OH-DPAT from human 5-HT1A receptor expressed in HEK293 cells after 1 hr by beta-counting
In DepthDetails ArticlePubMed
Target5-hydroxytryptamine receptor 7(Homo sapiens (Human))
Jagiellonian University Medical College
Curated by ChEMBL
LigandPNGBDBM50003937(CHEMBL3235731)
Affinity DataKi:  1.20E+3nM. Assay description: Displacement of [3H]-5-CT from human 5-HT7 receptor expressed in HEK293 cells after 1 hr by beta-counting
In DepthDetails ArticlePubMed