BDBM50004037 CHEMBL140737::N-(2-(1-benzylpiperidin-4-yl)ethyl)-4-fluoro-N-phenylbenzamide::N-[2-(1-Benzyl-piperidin-4-yl)-ethyl]-4-fluoro-N-phenyl-benzamide
SMILES Fc1ccc(cc1)C(=O)N(CCC1CCN(Cc2ccccc2)CC1)c1ccccc1
InChI Key InChIKey=IYFAOWGKGUWALB-UHFFFAOYSA-N
Data  2 IC50
  Tab Delimited (TSV)   2D SDfile   Computed 3D by Vconf -m prep SDfile
Find this compound or compounds like it in BindingDB:
Activity Spreadsheet -- Enzyme Inhibition Constant Data from BindingDB
Found 2 hits for monomerid = 50004037
TargetAcetylcholinesterase(Homo sapiens (Human))
Sichuan University
Curated by ChEMBL
LigandPNGBDBM50004037(CHEMBL140737 | N-(2-(1-benzylpiperidin-4-yl)ethyl)...)
Affinity DataIC50:  18nM. Assay description: Inhibition of AChE
In DepthDetails ArticlePubMed
TargetAcetylcholinesterase(Mus musculus (mouse))
Eisai
Curated by ChEMBL
LigandPNGBDBM50004037(CHEMBL140737 | N-(2-(1-benzylpiperidin-4-yl)ethyl)...)
Affinity DataIC50:  18nM. Assay description: In vitro inhibitory concentration against acetylcholinesterase (AChE) obtained from mouse brain homogenate.
In DepthDetails ArticlePubMed