BDBM50004118 1-Ethoxymethyl-5-isopropyl-6-phenylsulfanyl-2-thioxo-2,3-dihydro-1H-pyrimidin-4-one::CHEMBL133036
SMILES CCOCn1c(Sc2ccccc2)c(C(C)C)c(=O)[nH]c1=S
InChI Key InChIKey=JBXJJJIJIRTXCY-UHFFFAOYSA-N
Data  1 EC50
  Tab Delimited (TSV)   2D SDfile   Computed 3D by Vconf -m prep SDfile
Find this compound or compounds like it in BindingDB:
Activity Spreadsheet -- Enzyme Inhibition Constant Data from BindingDB
Found 1 hit for monomerid = 50004118
TargetReverse transcriptase/RNaseH(Human immunodeficiency virus 1)
Université
Curated by ChEMBL
LigandPNGBDBM50004118(1-Ethoxymethyl-5-isopropyl-6-phenylsulfanyl-2-thio...)
Affinity DataEC50:  14nM. Assay description: Inhibitory concentration against HIV-1 reverse transcriptase
In DepthDetails ArticlePubMed