BDBM50004146 5-Methyl-6-phenylsulfanyl-1-propoxymethyl-1H-pyrimidine-2,4-dione::CHEMBL40091
SMILES CCCOCn1c(Sc2ccccc2)c(C)c(=O)[nH]c1=O
InChI Key InChIKey=VLJGNNUWYMFUAN-UHFFFAOYSA-N
Data  2 EC50
  Tab Delimited (TSV)   2D SDfile   Computed 3D by Vconf -m prep SDfile
Find this compound or compounds like it in BindingDB:
Activity Spreadsheet -- Enzyme Inhibition Constant Data from BindingDB
Found 2 hits for monomerid = 50004146
TargetReverse transcriptase/RNaseH(Human immunodeficiency virus 1)
Yale University
Curated by ChEMBL
LigandPNGBDBM50004146(5-Methyl-6-phenylsulfanyl-1-propoxymethyl-1H-pyrim...)
Affinity DataEC50:  3.60E+3nM. Assay description: Inhibition of HIV-1 reverse transcriptase at 37 degree centigrade
In DepthDetails ArticlePubMed
TargetReverse transcriptase/RNaseH(Human immunodeficiency virus 1)
Yale University
Curated by ChEMBL
LigandPNGBDBM50004146(5-Methyl-6-phenylsulfanyl-1-propoxymethyl-1H-pyrim...)
Affinity DataEC50:  3.60E+3nM. Assay description: Inhibitory concentration against HIV-1 reverse transcriptase
In DepthDetails ArticlePubMed