BDBM50004148 1-Benzyloxymethyl-5-isopropyl-6-phenylsulfanyl-1H-pyrimidine-2,4-dione::CHEMBL39015
SMILES CC(C)c1c(Sc2ccccc2)n(COCc2ccccc2)c(=O)[nH]c1=O
InChI Key InChIKey=WGWFCFMAZPEFFJ-UHFFFAOYSA-N
Data  2 EC50
  Tab Delimited (TSV)   2D SDfile   Computed 3D by Vconf -m prep SDfile
Find this compound or compounds like it in BindingDB:
Activity Spreadsheet -- Enzyme Inhibition Constant Data from BindingDB
Found 2 hits for monomerid = 50004148
TargetReverse transcriptase/RNaseH(Human immunodeficiency virus 1)
Yale University
Curated by ChEMBL
LigandPNGBDBM50004148(1-Benzyloxymethyl-5-isopropyl-6-phenylsulfanyl-1H-...)
Affinity DataEC50:  2.70nM. Assay description: Inhibition of HIV-1 reverse transcriptase at 37 degree centigrade
In DepthDetails ArticlePubMed
TargetReverse transcriptase/RNaseH(Human immunodeficiency virus 1)
Yale University
Curated by ChEMBL
LigandPNGBDBM50004148(1-Benzyloxymethyl-5-isopropyl-6-phenylsulfanyl-1H-...)
Affinity DataEC50:  2.70nM. Assay description: Inhibitory concentration against HIV-1 reverse transcriptase
In DepthDetails ArticlePubMed