BDBM50004371 2-{4-[(2-Methyl-quinolin-6-ylmethyl)-prop-2-ynyl-amino]-benzoylamino}-pentanedioic acid ; hydrate::CHEMBL432828
SMILES Cc1ccc2cc(CN(CC#C)c3ccc(cc3)C(=O)N[C@@H](CCC(O)=O)C(O)=O)ccc2n1
InChI Key InChIKey=ISTRUGLUDXBBDX-QHCPKHFHSA-N
Data  1 IC50
  Tab Delimited (TSV)   2D SDfile   Computed 3D by Vconf -m prep SDfile
Find this compound or compounds like it in BindingDB:
Activity Spreadsheet -- Enzyme Inhibition Constant Data from BindingDB
Found 1 hit for monomerid = 50004371
TargetThymidylate synthase(Mus musculus)
Ici Pharmaceuticals Group
Curated by ChEMBL
LigandPNGBDBM50004371(2-{4-[(2-Methyl-quinolin-6-ylmethyl)-prop-2-ynyl-a...)
Affinity DataIC50:  7.90E+3nM. Assay description: In vitro inhibitory activity against thymidylate synthase from L1210 mouse leukemia cells
In DepthDetails ArticlePubMed