BDBM50004527 CHEMBL2216860
SMILES COc1ccc(cc1NS(C)(=O)=O)-c1cc(-c2ncc(CN3C[C@H](C)O[C@H](C)C3)o2)c2cn[nH]c2c1
InChI Key InChIKey=SDKPPLPIRKHEAM-IYBDPMFKSA-N
Data  1 IC50
  Tab Delimited (TSV)   2D SDfile   Computed 3D by Vconf -m prep SDfile
Find this compound or compounds like it in BindingDB:
Activity Spreadsheet -- Enzyme Inhibition Constant Data from BindingDB
Found 1 hit for monomerid = 50004527
LigandPNGBDBM50004527(CHEMBL2216860)
Affinity DataIC50: >100nM. Assay description: Inhibition of PI3Kdelta
In DepthDetails ArticlePubMed