BDBM50004538 CHEMBL2216868
SMILES Cn1c(nc2c(ncnc12)N1CCC(CC1)n1c2cccnc2[nH]c1=O)C(=O)NCC(F)(F)F
InChI Key InChIKey=KZYGZJBRRBJVCK-UHFFFAOYSA-N
Data  1 IC50
  Tab Delimited (TSV)   2D SDfile   Computed 3D by Vconf -m prep SDfile
Find this compound or compounds like it in BindingDB:
Activity Spreadsheet -- Enzyme Inhibition Constant Data from BindingDB
Found 1 hit for monomerid = 50004538
LigandPNGBDBM50004538(CHEMBL2216868)
Affinity DataIC50: <50nM. Assay description: Inhibition of PI3Kdelta
In DepthDetails ArticlePubMed