BDBM50004554 5-{[[2-(2-Methoxy-ethoxy)-ethyl]-(2-methoxy-ethyl)-amino]-methyl}-thieno[2,3-b]furan-2-sulfonic acid amide::CHEMBL103255
SMILES COCCOCCN(CCOC)Cc1cc2cc(oc2s1)S(N)(=O)=O
InChI Key InChIKey=QPHBYATYQZEDRC-UHFFFAOYSA-N
Data  1 KI
  Tab Delimited (TSV)   2D SDfile   Computed 3D by Vconf -m prep SDfile
Find this compound or compounds like it in BindingDB:
Activity Spreadsheet -- Enzyme Inhibition Constant Data from BindingDB
Found 1 hit for monomerid = 50004554
TargetCarbonic anhydrase 2(Homo sapiens (Human))
Merck Research Laboratories
Curated by ChEMBL
LigandPNGBDBM50004554(5-{[[2-(2-Methoxy-ethoxy)-ethyl]-(2-methoxy-ethyl)...)
Affinity DataKi:  3.60nM. Assay description: Compound was evaluated for the inhibition of dansylamide at human carbonic anhydrase II
In DepthDetails ArticlePubMed