BDBM50004561 CHEMBL2216875
SMILES CC(=O)Nc1nc2ccc(cc2s1)-c1nn(C2CCCC2)c2ncnc(N)c12
InChI Key InChIKey=VLJBDXXWPQCWCH-UHFFFAOYSA-N
Data  1 IC50
  Tab Delimited (TSV)   2D SDfile   Computed 3D by Vconf -m prep SDfile
Find this compound or compounds like it in BindingDB:
Activity Spreadsheet -- Enzyme Inhibition Constant Data from BindingDB
Found 1 hit for monomerid = 50004561
LigandPNGBDBM50004561(CHEMBL2216875)
Affinity DataIC50: <50nM. Assay description: Inhibition of PI3Kdelta
In DepthDetails ArticlePubMed