BDBM50004592 8-Adamantan-1-ylmethyl-1,3-dipropyl-3,7-dihydro-purine-2,6-dione::CHEMBL415323
SMILES CCCn1c2nc(CC34CC5CC(CC(C5)C3)C4)[nH]c2c(=O)n(CCC)c1=O
InChI Key InChIKey=WMOOCJKZZKAZRT-UHFFFAOYSA-N
Data  2 KI
  Tab Delimited (TSV)   2D SDfile   Computed 3D by Vconf -m prep SDfile
Find this compound or compounds like it in BindingDB:
Activity Spreadsheet -- Enzyme Inhibition Constant Data from BindingDB
Found 2 hits for monomerid = 50004592
TargetAdenosine receptor A1(GUINEA PIG)
Kyowa Hakko Kogyo
Curated by ChEMBL
LigandPNGBDBM50004592(8-Adamantan-1-ylmethyl-1,3-dipropyl-3,7-dihydro-pu...)
Affinity DataKi:  880nM. Assay description: Binding affinity against adenosine A1 receptor in guinea pig forebrain membranes using N6-[3H]cyclohexyladenosine as radioligand
In DepthDetails ArticlePubMed
TargetAdenosine receptor A2a/A2b(Rattus norvegicus)
Kyowa Hakko Kogyo
Curated by ChEMBL
LigandPNGBDBM50004592(8-Adamantan-1-ylmethyl-1,3-dipropyl-3,7-dihydro-pu...)
Affinity DataKi: >1.00E+5nM. Assay description: Binding affinity against adenosine A2 receptor in rat striatal membranes using N-[3H]-ethyladenosin-5''-uronamide as radioligand in the presence of 5...
In DepthDetails ArticlePubMed