BDBM50004608 2-{2-[2-(2-Acetylamino-5-guanidino-pentanoylamino)-3-hydroxy-propionylamino]-3-methyl-butyrylamino}-pentanedioic acid diamide::CHEMBL264393
SMILES CC(C)[C@H](NC(=O)[C@H](CO)NC(=O)[C@H](CCCNC(N)=N)NC(C)=O)C(=O)N[C@@H](CCC(N)=O)C(N)=O
InChI Key InChIKey=FVFQLPZSQIZAFV-YXWQFLTLSA-N
Data  1 KI
  Tab Delimited (TSV)   2D SDfile   Computed 3D by Vconf -m prep SDfile
Find this compound or compounds like it in BindingDB:
Activity Spreadsheet -- Enzyme Inhibition Constant Data from BindingDB
Found 1 hit for monomerid = 50004608
TargetKallikrein(Sus scrofa)
University Hospital
Curated by ChEMBL
LigandPNGBDBM50004608(2-{2-[2-(2-Acetylamino-5-guanidino-pentanoylamino)...)
Affinity DataKi:  9.50E+5nM. Assay description: Inhibitory activity against beta-kallikrein
In DepthDetails ArticlePubMed