BDBM50004614 1-Acetyl-pyrrolidine-2-carboxylic acid {1-[1-(1-carbamoyl-2-hydroxy-ethylcarbamoyl)-4-guanidino-butylcarbamoyl]-2-phenyl-ethyl}-amide::CHEMBL321324
SMILES CC(=O)N1CCC[C@H]1C(=O)N[C@@H](Cc1ccccc1)C(=O)N[C@@H](CCCNC(N)=N)C(=O)N[C@@H](CO)C(N)=O
InChI Key InChIKey=XAWXSQISJXUZIM-MUGJNUQGSA-N
Data  1 KI
  Tab Delimited (TSV)   2D SDfile   Computed 3D by Vconf -m prep SDfile
Find this compound or compounds like it in BindingDB:
Activity Spreadsheet -- Enzyme Inhibition Constant Data from BindingDB
Found 1 hit for monomerid = 50004614
TargetKallikrein(Sus scrofa)
University Hospital
Curated by ChEMBL
LigandPNGBDBM50004614(1-Acetyl-pyrrolidine-2-carboxylic acid {1-[1-(1-ca...)
Affinity DataKi:  5.78E+5nM. Assay description: Inhibitory activity against beta-kallikrein
In DepthDetails ArticlePubMed