BDBM50004625 5-Carbamoyl-4-(2-chloro-phenyl)-6-methyl-2-[4-(2-methyl-imidazo[4,5-c]pyridin-1-yl)-phenyl]-1,4-dihydro-pyridine-3-carboxylic acid ethyl ester (H2O)::CHEMBL323407
SMILES CCOC(=O)C1=C(N=C(C)C(C1c1ccccc1Cl)C(N)=O)c1ccc(cc1)-n1c(C)nc2cnccc12
InChI Key InChIKey=VVIBDEGULHRYSM-UHFFFAOYSA-N
Data  1 IC50
  Tab Delimited (TSV)   2D SDfile   Computed 3D by Vconf -m prep SDfile
Find this compound or compounds like it in BindingDB:
Activity Spreadsheet -- Enzyme Inhibition Constant Data from BindingDB
Found 1 hit for monomerid = 50004625
TargetPlatelet-activating factor receptor(Cavia porcellus)
Pfizer
Curated by ChEMBL
LigandPNGBDBM50004625(5-Carbamoyl-4-(2-chloro-phenyl)-6-methyl-2-[4-(2-m...)
Affinity DataIC50:  5.60nM. Assay description: In vitro inhibition of PAF-induced aggregation of rabbit washed platelets.
In DepthDetails ArticlePubMed