BDBM50004639 6'-Methyl-2'-[4-(2-methyl-imidazo[4,5-c]pyridin-1-yl)-phenyl]-5'-(pyridin-2-ylcarbamoyl)-1',4'-dihydro-[2,4']bipyridinyl-3'-carboxylic acid ethyl ester (0.5 H2O)::CHEMBL326201
SMILES CCOC(=O)C1=C(N=C(C)C(C1c1ccccn1)C(=O)Nc1ccccn1)c1ccc(cc1)-n1c(C)nc2cnccc12
InChI Key InChIKey=QLWOEZDEICUPSE-UHFFFAOYSA-N
Data  1 IC50
  Tab Delimited (TSV)   2D SDfile   Computed 3D by Vconf -m prep SDfile
Find this compound or compounds like it in BindingDB:
Activity Spreadsheet -- Enzyme Inhibition Constant Data from BindingDB
Found 1 hit for monomerid = 50004639
TargetPlatelet-activating factor receptor(Cavia porcellus)
Pfizer
Curated by ChEMBL
LigandPNGBDBM50004639(6'-Methyl-2'-[4-(2-methyl-imidazo[4,5-c]pyridin-1-...)
Affinity DataIC50:  14nM. Assay description: In vitro inhibition of PAF-induced aggregation of rabbit washed platelets.
In DepthDetails ArticlePubMed