BDBM50004651 4-(2-Chloro-phenyl)-6-methyl-2-[4-(2-methyl-imidazo[4,5-b]pyridin-3-yl)-phenyl]-5-(pyridin-2-ylcarbamoyl)-1,4-dihydro-pyridine-3-carboxylic acid ethyl ester (0.5 H2O)::CHEMBL326012
SMILES CCOC(=O)C1=C(N=C(C)C(C1c1ccccc1Cl)C(=O)Nc1ccccn1)c1ccc(cc1)-n1c(C)nc2cccnc12
InChI Key InChIKey=ZVNQRDGBAXITJP-UHFFFAOYSA-N
Data  1 IC50
  Tab Delimited (TSV)   2D SDfile   Computed 3D by Vconf -m prep SDfile
Find this compound or compounds like it in BindingDB:
Activity Spreadsheet -- Enzyme Inhibition Constant Data from BindingDB
Found 1 hit for monomerid = 50004651
TargetPlatelet-activating factor receptor(Cavia porcellus)
Pfizer
Curated by ChEMBL
LigandPNGBDBM50004651(4-(2-Chloro-phenyl)-6-methyl-2-[4-(2-methyl-imidaz...)
Affinity DataIC50:  28nM. Assay description: In vitro inhibition of PAF-induced aggregation of rabbit washed platelets.
In DepthDetails ArticlePubMed