BDBM50004675 2-[2-(5-Dimethylaminomethyl-furan-2-ylmethylsulfanyl)-ethylamino]-6-fluoro-benzonitrile::CHEMBL421601
SMILES CN(C)Cc1ccc(CSCCNc2cccc(F)c2C#N)o1
InChI Key InChIKey=ADLLVJJAMGWNEL-UHFFFAOYSA-N
Data  1 IC50
  Tab Delimited (TSV)   2D SDfile   Computed 3D by Vconf -m prep SDfile
Find this compound or compounds like it in BindingDB:
Activity Spreadsheet -- Enzyme Inhibition Constant Data from BindingDB
Found 1 hit for monomerid = 50004675
TargetAcetylcholinesterase(Homo sapiens (Human))
University Of South Carolina
Curated by ChEMBL
LigandPNGBDBM50004675(2-[2-(5-Dimethylaminomethyl-furan-2-ylmethylsulfan...)
Affinity DataIC50:  2.10E+3nM. Assay description: In vitro acetyl cholinesterase(AChE-I) inhibitory activity of the compound to determine its ability to reverse the cholinergic deficit characteristic...
In DepthDetails ArticlePubMed