BDBM50004723 5-Methyl-1-phenyl-7-propyl-1,7-dihydro-pyrazolo[3,4-d]pyrimidine-4,6-dione::CHEMBL322801
SMILES CCCn1c2n(ncc2c(=O)n(C)c1=O)-c1ccccc1
InChI Key InChIKey=FAMNKZDEQYOJGJ-UHFFFAOYSA-N
Data  1 IC50
  Tab Delimited (TSV)   2D SDfile   Computed 3D by Vconf -m prep SDfile
Find this compound or compounds like it in BindingDB:
Activity Spreadsheet -- Enzyme Inhibition Constant Data from BindingDB
Found 1 hit for monomerid = 50004723
TargetAdenosine receptor A1(Rattus norvegicus (rat))
Marion Merrell Dow Research Institute
Curated by ChEMBL
LigandPNGBDBM50004723(5-Methyl-1-phenyl-7-propyl-1,7-dihydro-pyrazolo[3,...)
Affinity DataIC50:  3.50E+4nM. Assay description: Inhibition of [3H]-CHA binding to Adenosine A1 receptor in rat cerebral cortical membranes
In DepthDetails ArticlePubMed